{"text_format":"1","workbook":"xlsx","n_sheets":6,"sheets":["Order Summary","Opening 1","Opening 2","Door Drive","Sheet5","Form Tables. "],"not_rendered":{"charts":0,"images":3,"macros":1,"external_links":0,"defined_names":19,"comments":2,"pivot_tables":0},"unopened":[],"bounds":{"document_bytes":16777216,"sheet_cells":100000,"rows_first":2000,"rows_last":500,"rows_between":2000,"halvings":0,"cell_chars":16384,"cell_head_chars":4096},"cells_cut":0,"cells_raw":0,"read":"whole","date_system":"1900"}

{"sheet":"Order Summary","index":0,"n_rows":47,"n_cols":4,"rows_kept":47,"cut":false,"hidden":false,"merged":[[5,1,6,2]]}
[null,null,"Door Operator Form"]
[]
[null,"Job Name"]
[null,"Job Address"]
[null,"Installed Base Serial Number"]
[null,"Enter unit information on the Opening tabs. Based on your selections, the parts list for the unit will populate below. "]
[]
[null,"Part #","Print #","Description"]
["Opening 1",{"$f":"'Opening 1'!B21","v":9734934},{"$f":"'Opening 1'!C21","v":"200CEV101"},{"$f":"'Opening 1'!D21","v":"DOOR OPERATOR, RH"}]
[null,{"$f":"'Opening 1'!B22","v":9736013},{"$f":"'Opening 1'!C22","v":"200CRM001"},{"$f":"'Opening 1'!D22","v":"KIT, CABLE TIE"}]
[null,{"$f":"'Opening 1'!B23","v":9736116},{"$f":"'Opening 1'!C23","v":"200CTB001"},{"$f":"'Opening 1'!D23","v":"KIT, CAR TOP LIGHT"}]
[null,{"$f":"'Opening 1'!B24","v":9736311},{"$f":"'Opening 1'!C24","v":"200CMM001"},{"$f":"'Opening 1'!D24","v":"KIT, DOOR WEIGHT LABEL"}]
[null,{"$f":"'Opening 1'!B25","v":9736517},{"$f":"'Opening 1'!C25","v":"546WX003"},{"$f":"'Opening 1'!D25","v":"JUNCTION BOX ASSEMBLY, CTS, MOD"}]
[null,{"$f":"'Opening 1'!B26","v":9736712},{"$f":"'Opening 1'!C26","v":"200CLY001"},{"$f":"'Opening 1'!D26","v":"KIT, DOOR OPERATOR MOUNTING"}]
[null,{"$f":"'Opening 1'!B27","v":9736815},{"$f":"'Opening 1'!C27","v":"200CTN001"},{"$f":"'Opening 1'!D27","v":"KIT, CLUTCH ACTUATION"}]
[null,{"$f":"'Opening 1'!B28","v":9737716},{"$f":"'Opening 1'!C28","v":"196BBH001"},{"$f":"'Opening 1'!D28","v":"BRKT ASSY, RELATING CABLE "}]
[null,{"$f":"'Opening 1'!B29","v":""},{"$f":"'Opening 1'!C29","v":""},{"$f":"'Opening 1'!D29","v":""}]
[null,{"$f":"'Opening 1'!B30","v":9735136},{"$f":"'Opening 1'!C30","v":"196DTA001"},{"$f":"'Opening 1'!D30","v":"BRACKET ASSEMBLY, PULLEY"}]
[null,{"$f":"'Opening 1'!B31","v":9734790},{"$f":"'Opening 1'!C31","v":"186FE001"},{"$f":"'Opening 1'!D31","v":"STATION, ASSEMBLY, CAR TOP, UDO, FRONT"}]
[null,{"$f":"'Opening 1'!B32","v":9735240},{"$f":"'Opening 1'!C32","v":"462AEN007"},{"$f":"'Opening 1'!D32","v":"HARNESS, FRONT, EXTENSION"}]
[null,{"$f":"'Opening 1'!B33","v":9735458},{"$f":"'Opening 1'!C33","v":"462AEN010"},{"$f":"'Opening 1'!D33","v":"HARNESS, FRONT, EXTENSION"}]
[null,{"$f":"'Opening 1'!B34","v":0},{"$f":"'Opening 1'!C34","v":""},{"$f":"'Opening 1'!D34","v":""}]
[null,{"$f":"'Opening 1'!B35","v":9734764},{"$f":"'Opening 1'!C35","v":"462AEM001"},{"$f":"'Opening 1'!D35","v":"HARNESS, FRONT ADAPTER"}]
[null,{"$f":"'Opening 1'!B36","v":9734673},{"$f":"'Opening 1'!C36","v":"462AEM010"},{"$f":"'Opening 1'!D36","v":"HARNESS, FRONT ADAPTER"}]
[null,{"$f":"'Opening 1'!B37","v":9734776},{"$f":"'Opening 1'!C37","v":"462AEM012"},{"$f":"'Opening 1'!D37","v":"HARNESS, FRONT ADAPTER"}]
[null,{"$f":"'Opening 1'!B38","v":0},{"$f":"'Opening 1'!C38","v":""},{"$f":"'Opening 1'!D38","v":""}]
[null,{"$f":"'Opening 1'!B39","v":""},{"$f":"'Opening 1'!C39","v":""},{"$f":"'Opening 1'!D39","v":""}]
[null,{"$f":"'Opening 1'!B40","v":""},{"$f":"'Opening 1'!C40","v":""},{"$f":"'Opening 1'!D40","v":""}]
["Opening 2 ",{"$f":"'Opening 2'!B21","v":9735422},{"$f":"'Opening 2'!C21","v":"200CEV001"},{"$f":"'Opening 2'!D21","v":"DOOR OPERATOR, LH"}]
[null,{"$f":"'Opening 2'!B22","v":9736013},{"$f":"'Opening 2'!C22","v":"200CRM001"},{"$f":"'Opening 2'!D22","v":"KIT, CABLE TIE"}]
{"$rows_left_out":18}
{"sheet":"Opening 1","index":1,"n_rows":40,"n_cols":12,"rows_kept":40,"cut":false,"hidden":false,"merged":[]}
[null,"Opening 1:","LD-16, Door Drive","*This form is configured to select components for one Drive-Only Door operator per opening. Questions are specific to front and rear openings, controller types, ect. Reset the form as needed after each opening has been configured. "]
[]
[null,null,"Door Operator Drive Hand","Right Handed",null,null,"Yes"]
[null,null,null,null,null,null,"No ",null,null,null,null," "]
[null,null,"Is Center-Opening with TKE Linear Operator?","Yes",null,null,null,null,null,null,null,"Front TAC32T"]
[]
[null,null,"Cab Opening?","Front"]
[null,null,null,null,null,null,"Right Handed",null,null,null,null,"Front TAC32H"]
[null,null,"Operator Configuation:","Front TKE COP",null,null,"Left Handed",null,null,null,null,"Front Futura T / TAC50-04"]
[null,null,null,null,null,null,null,null,null,null,null,"Front TAC22 / ICON / TAC20-03 / TAC20 / TAC50-03"]
[null,null,"Controller Type: ","Front TAC32T",null,null,"Front TKE COP",null,null,null,null,"Front Other"]
[null,null,null,null,null,null,"Front TKE CTB",null,null,null,null,"Rear TAC32T"]
[null,null,"Is GAL Center-Opening?",null,null,null,"Front Other",null,null,null,null,"Rear TAC32H"]
[null,null,"If Yes, Door Width? ",null,null,null,"Rear TKE COP",null,null,null,null,"Rear Futura T / TAC50-04"]
[null,null,null,null,null,null,"Rear CTB",null,null,null,null,"Rear TAC22 / ICON / TAC20-03 / TAC20 / TAC50-03"]
[null,null,"Service Tool? ",null,null,null,"Rear Other",null,null,null,null,"Rear Other"]
[null,null,"Cedes Min_32-NA-TKE (Safety Edge)?"]
[]
[]
[null,"Part #","Print #","Description"]
[null,{"$f":"IF($D$3=\"Left Handed\",Sheet5!B4,IF('Opening 1'!$D$3=\"Right Handed\",Sheet5!H4,IF($D$3=G10,\"\")))","v":9734934},{"$f":"IFERROR(VLOOKUP(B21,'Door Drive'!B2:N51,2,FALSE),\"\")","v":"200CEV101"},{"$f":"IFERROR(VLOOKUP(B21,'Door Drive'!B2:N51,4,FALSE),\"\")","v":"DOOR OPERATOR, RH"}]
[null,{"$f":"IF($D$3=\"Left Handed\",Sheet5!B5,IF('Opening 1'!$D$3=\"Right Handed\",Sheet5!H5,IF($D$3=G10,\"\")))","v":9736013},{"$f":"IFERROR(VLOOKUP(B22,'Door Drive'!B3:N52,2,FALSE),\"\")","v":"200CRM001"},{"$f":"IFERROR(VLOOKUP(B22,'Door Drive'!B3:N52,4,FALSE),\"\")","v":"KIT, CABLE TIE"},null," "]
[null,{"$f":"IF($D$3=\"Left Handed\", Sheet5!B6,IF('Opening 1'!$D$3=\"Right Handed\",Sheet5!H6,IF($D$3=G10,\"\")))","v":9736116},{"$f":"IFERROR(VLOOKUP(B23,'Door Drive'!B4:N53,2,FALSE),\"\")","v":"200CTB001"},{"$f":"IFERROR(VLOOKUP(B23,'Door Drive'!B4:N53,4,FALSE),\"\")","v":"KIT, CAR TOP LIGHT"},null," "]
[null,{"$f":"IF($D$3=\"Left Handed\", Sheet5!B7,IF('Opening 1'!$D$3=\"Right Handed\",Sheet5!H7,IF($D$3=G10,\"\")))","v":9736311},{"$f":"IFERROR(VLOOKUP(B24,'Door Drive'!B5:N54,2,FALSE),\"\")","v":"200CMM001"},{"$f":"IFERROR(VLOOKUP(B24,'Door Drive'!B5:N54,4,FALSE),\"\")","v":"KIT, DOOR WEIGHT LABEL"}]
[null,{"$f":"IF($D$3=\"Left Handed\", Sheet5!B9,IF('Opening 1'!$D$3=\"Right Handed\",Sheet5!H9,IF($D$3=G10,\"\")))","v":9736517},{"$f":"IFERROR(VLOOKUP(B25,'Door Drive'!B7:N56,2,FALSE),\"\")","v":"546WX003"},{"$f":"IFERROR(VLOOKUP(B25,'Door Drive'!B7:N56,4,FALSE),\"\")","v":"JUNCTION BOX ASSEMBLY, CTS, MOD"}]
[null,{"$f":"IF($D$3=\"Left Handed\", Sheet5!B10,IF('Opening 1'!$D$3=\"Right Handed\",Sheet5!H10,IF($D$3=G10,\"\")))","v":9736712},{"$f":"IFERROR(VLOOKUP(B26,'Door Drive'!B8:N57,2,FALSE),\"\")","v":"200CLY001"},{"$f":"IFERROR(VLOOKUP(B26,'Door Drive'!B8:N57,4,FALSE),\"\")","v":"KIT, DOOR OPERATOR MOUNTING"}]
[null,{"$f":"IF($D$3=\"Left Handed\", Sheet5!B11,IF('Opening 1'!$D$3=\"Right Handed\",Sheet5!H11,IF($D$3=G10,\"\")))","v":9736815},{"$f":"IFERROR(VLOOKUP(B27,'Door Drive'!B9:N58,2,FALSE),\"\")","v":"200CTN001"},{"$f":"IFERROR(VLOOKUP(B27,'Door Drive'!B9:N58,4,FALSE),\"\")","v":"KIT, CLUTCH ACTUATION"}]
[null,{"$f":"IF($D$3=\"Left Handed\", Sheet5!B12,IF('Opening 1'!$D$3=\"Right Handed\",Sheet5!H12,IF($D$3=G10,\"\")))","v":9737716},{"$f":"IFERROR(VLOOKUP(B28,'Door Drive'!B10:N59,2,FALSE),\"\")","v":"196BBH001"},{"$f":"IFERROR(VLOOKUP(B28,'Door Drive'!B10:N59,4,FALSE),\"\")","v":"BRKT ASSY, RELATING CABLE "}]
[null,{"$f":"IF($D$17=\"Yes\",Sheet5!B13,IF($D$17=G10,\"\",IF(D17=G4,\"\")))","v":""},{"$f":"IFERROR(VLOOKUP(B29,'Door Drive'!B11:N60,2,FALSE),\"\")","v":""},{"$f":"IFERROR(VLOOKUP(B29,'Door Drive'!B11:N60,4,FALSE),\"\")","v":""}]
[null,{"$f":"IF(D5=\"Yes\",Sheet5!B17,IF($D$5=G10,\"\",IF($D$5=\"no\"=G10,\"\")))","v":9735136},{"$f":"IFERROR(VLOOKUP(B30,'Door Drive'!B2:N51,2,FALSE),\"\")","v":"196DTA001"},{"$f":"IFERROR(VLOOKUP(B30,'Door Drive'!B2:N51,4,FALSE),\"\")","v":"BRACKET ASSEMBLY, PULLEY"}]
{"$rows_left_out":11}
{"sheet":"Opening 2","index":2,"n_rows":40,"n_cols":12,"rows_kept":40,"cut":false,"hidden":false,"merged":[]}
[null,"Opening 2:","LD-16, Door Drive","*This form is configured to select components for one Drive-Only Door operator per opening. Questions are specific to front and rear openings, controller types, ect. Reset the form as needed after each opening has been configured. "]
[]
[null,null,"Door Operator Drive Hand","Left Handed",null,null,"Yes"]
[null,null,null,null,null,null,"No ",null,null,null,null," "]
[null,null,"Is Center-Opening with TKE Linear Operator?","No ",null,null,null,null,null,null,null,"Front TAC32T"]
[]
[null,null,"Cab Opening?","Front"]
[null,null,null,null,null,null,"Right Handed",null,null,null,null,"Front TAC32H"]
[null,null,"Operator Configuation:","Front CTB",null,null,"Left Handed",null,null,null,null,"Front Futura T / TAC50-04"]
[null,null,null,null,null,null,null,null,null,null,null,"Front TAC22 / ICON / TAC20-03 / TAC20 / TAC50-03"]
[null,null,"Controller Type: ","Front TAC32T",null,null,"Front TKE COP",null,null,null,null,"Front Other"]
[null,null,null,null,null,null,"Front TKE CTB",null,null,null,null,"Rear TAC32T"]
[null,null,"Is GAL Center-Opening?",null,null,null,"Front Other",null,null,null,null,"Rear TAC32H"]
[null,null,"If Yes, Door Width? ",null,null,null,"Rear TKE COP",null,null,null,null,"Rear Futura T / TAC50-04"]
[null,null,null,null,null,null,"Rear CTB",null,null,null,null,"Rear TAC22 / ICON / TAC20-03 / TAC20 / TAC50-03"]
[null,null,null,null,null,null,"Rear Other",null,null,null,null,"Rear Other"]
[null,null,"Cedes Min_32-NA-TKE (Safety Edge)?"]
[]
[]
[null,"Part #","Print #","Description"]
[null,{"$f":"IF($D$3=\"Left Handed\",Sheet5!B4,IF('Opening 2'!$D$3=\"Right Handed\",Sheet5!H4,IF($D$3=G10,\"\")))","v":9735422},{"$f":"IFERROR(VLOOKUP(B21,'Door Drive'!B2:N51,2,FALSE),\"\")","v":"200CEV001"},{"$f":"IFERROR(VLOOKUP(B21,'Door Drive'!B2:N51,4,FALSE),\"\")","v":"DOOR OPERATOR, LH"}]
[null,{"$f":"IF($D$3=\"Left Handed\",Sheet5!B5,IF('Opening 2'!$D$3=\"Right Handed\",Sheet5!H5,IF($D$3=G10,\"\")))","v":9736013},{"$f":"IFERROR(VLOOKUP(B22,'Door Drive'!B3:N52,2,FALSE),\"\")","v":"200CRM001"},{"$f":"IFERROR(VLOOKUP(B22,'Door Drive'!B3:N52,4,FALSE),\"\")","v":"KIT, CABLE TIE"},null," "]
[null,{"$f":"IF($D$3=\"Left Handed\", Sheet5!B6,IF('Opening 2'!$D$3=\"Right Handed\",Sheet5!H6,IF($D$3=G10,\"\")))","v":9736116},{"$f":"IFERROR(VLOOKUP(B23,'Door Drive'!B4:N53,2,FALSE),\"\")","v":"200CTB001"},{"$f":"IFERROR(VLOOKUP(B23,'Door Drive'!B4:N53,4,FALSE),\"\")","v":"KIT, CAR TOP LIGHT"},null," "]
[null,{"$f":"IF($D$3=\"Left Handed\", Sheet5!B7,IF('Opening 2'!$D$3=\"Right Handed\",Sheet5!H7,IF($D$3=G10,\"\")))","v":9736311},{"$f":"IFERROR(VLOOKUP(B24,'Door Drive'!B5:N54,2,FALSE),\"\")","v":"200CMM001"},{"$f":"IFERROR(VLOOKUP(B24,'Door Drive'!B5:N54,4,FALSE),\"\")","v":"KIT, DOOR WEIGHT LABEL"}]
[null,{"$f":"IF($D$3=\"Left Handed\", Sheet5!B9,IF('Opening 2'!$D$3=\"Right Handed\",Sheet5!H9,IF($D$3=G10,\"\")))","v":9736517},{"$f":"IFERROR(VLOOKUP(B25,'Door Drive'!B7:N56,2,FALSE),\"\")","v":"546WX003"},{"$f":"IFERROR(VLOOKUP(B25,'Door Drive'!B7:N56,4,FALSE),\"\")","v":"JUNCTION BOX ASSEMBLY, CTS, MOD"}]
[null,{"$f":"IF($D$3=\"Left Handed\", Sheet5!B10,IF('Opening 2'!$D$3=\"Right Handed\",Sheet5!H10,IF($D$3=G10,\"\")))","v":9736712},{"$f":"IFERROR(VLOOKUP(B26,'Door Drive'!B8:N57,2,FALSE),\"\")","v":"200CLY001"},{"$f":"IFERROR(VLOOKUP(B26,'Door Drive'!B8:N57,4,FALSE),\"\")","v":"KIT, DOOR OPERATOR MOUNTING"}]
[null,{"$f":"IF($D$3=\"Left Handed\", Sheet5!B11,IF('Opening 2'!$D$3=\"Right Handed\",Sheet5!H11,IF($D$3=G10,\"\")))","v":9736815},{"$f":"IFERROR(VLOOKUP(B27,'Door Drive'!B9:N58,2,FALSE),\"\")","v":"200CTN001"},{"$f":"IFERROR(VLOOKUP(B27,'Door Drive'!B9:N58,4,FALSE),\"\")","v":"KIT, CLUTCH ACTUATION"}]
[null,{"$f":"IF($D$3=\"Left Handed\", Sheet5!B12,IF('Opening 2'!$D$3=\"Right Handed\",Sheet5!H12,IF($D$3=G10,\"\")))","v":9737716},{"$f":"IFERROR(VLOOKUP(B28,'Door Drive'!B10:N59,2,FALSE),\"\")","v":"196BBH001"},{"$f":"IFERROR(VLOOKUP(B28,'Door Drive'!B10:N59,4,FALSE),\"\")","v":"BRKT ASSY, RELATING CABLE "}]
[null,{"$f":"IF($D$17=\"Yes\",Sheet5!B13,IF($D$17=G10,\"\",IF(D17=G4,\"\")))","v":""},{"$f":"IFERROR(VLOOKUP(B29,'Door Drive'!B11:N60,2,FALSE),\"\")","v":""},{"$f":"IFERROR(VLOOKUP(B29,'Door Drive'!B11:N60,4,FALSE),\"\")","v":""}]
[null,{"$f":"IF(D5=\"Yes\",Sheet5!B17,IF($D$5=G10,\"\",IF($D$5=\"no\"=G10,\"\")))","v":""},{"$f":"IFERROR(VLOOKUP(B30,'Door Drive'!B2:N51,2,FALSE),\"\")","v":""},{"$f":"IFERROR(VLOOKUP(B30,'Door Drive'!B2:N51,4,FALSE),\"\")","v":""}]
{"$rows_left_out":11}
{"sheet":"Door Drive","index":3,"n_rows":53,"n_cols":18,"rows_kept":53,"cut":false,"hidden":true,"merged":[[39,2,39,3],[39,4,39,13],[39,17,39,21],[40,2,40,3],[40,4,40,13],[40,17,40,21],[49,2,49,3],[49,4,49,13],[44,2,44,3],[44,4,44,13],[42,2,42,3],[41,2,41,3],[43,4,43,13],[48,2,48,3],[35,17,35,21],[36,2,36,3],[36,4,36,13],[36,17,36,21],[37,2,37,3],[37,4,37,13],[37,17,37,21],[34,2,34,3],[38,17,38,21],[38,2,38,3],[31,2,31,3],[31,4,31,13],[27,4,27,13],[28,4,28,13],[4,4,4,13],[5,4,5,13],[3,4,3,13],[30,4,30,13],[29,4,29,13],[7,4,7,13],[21,4,21,13],[4,2,4,3],[29,2,29,3],[30,2,30,3],[11,2,11,3],[22,2,22,3],[5,2,5,3],[6,2,6,3],[7,2,7,3],[27,2,27,3],[19,2,19,3],[1,17,2,21],[3,17,3,21],[0,17,0,21],[1,0,2,0],[1,15,2,15],[0,2,0,3],[1,2,1,3],[2,2,2,3],[3,2,3,3],[0,4,0,13],[1,4,1,13],[2,4,2,13],[4,17,26,21],[25,4,25,13],[12,15,25,15],[18,2,18,3],[18,4,18,13],[4,15,11,15],[24,2,24,3],[24,4,24,13],[8,2,8,3],[8,4,8,13],[9,2,9,3],[9,4,9,13],[10,2,10,3],[20,2,20,3],[26,2,26,3],[11,4,11,13],[19,4,19,13],[20,4,20,13],[10,4,10,13],[12,4,12,13],[12,2,12,3],[6,4,6,13],[27,17,27,21],[28,17,28,21],[13,2,13,3],[13,4,13,13],[14,2,14,3],[21,2,21,3],[34,4,34,13],[22,4,22,13],[23,2,23,3],[23,4,23,13],[14,4,14,13],[15,2,15,3],[15,4,15,13],[16,2,16,3],[16,4,16,13],[17,2,17,3],[17,4,17,13],[25,2,25,3],[32,2,32,3],[33,2,33,3],[26,4,26,13],[33,4,33,13],[33,17,33,21],[34,17,34,21],[52,2,52,3],[30,17,30,21],[52,4,52,13],[50,2,50,3],[50,4,50,13],[51,2,51,3],[51,4,51,13],[47,2,47,3],[28,2,28,3],[47,4,47,13],[43,2,43,3],[46,2,46,3],[45,2,45,3],[45,4,45,13],[46,4,46,13],[48,4,48,13],[42,4,42,13],[38,4,38,13],[41,4,41,13],[31,17,31,21],[32,4,32,13],[32,17,32,21],[35,2,35,3],[35,4,35,13]]}
["ITEM","TYPE","PART NO.",null,"DESCRIPTION",null,null,null,null,null,null,null,null,null,"NOTE","QTY PER DRIVE ONLY","Application","SELECTION CRITERIA - ABREVIATED"]
[null,9735422,"200CEV001",null,"DOOR OPERATOR, LH",null,null,null,null,null,null,null,null,null,1.2,1,"Left Handed","LH or RH depending on door (standing in the car looking at the door).  On center opening applications, chose the driven door to decide to which hand operator needs to be selected."]
[null,9734934,"200CEV101",null,"DOOR OPERATOR, RH",null,null,null,null,null,null,null,null,null,1.2,null,"Right Handed"]
[null,9735136,"196DTA001",null,"BRACKET ASSEMBLY, PULLEY",null,null,null,null,null,null,null,null,null,1.2,"1 OR 0","FOR DOVER/tkE LINEAR CO","IS IT A CENTER OPENING DOVER OR TKE LINEAR?"]
[null,9734843,"462AEN005",null,"HARNESS, FRONT, EXTENSION",null,null,null,null,null,null,null,null,null,9,"SEE NOTE 9",null,"IS THE KIT FOR A FRONT OR REAR?                                             WHAT IS THE CONTROLLER TYPE?  SEE NOTES 9 AND 10.                                                                                            "]
[null,9735045,"462AEN006",null,"HARNESS, REAR, EXTENSION",null,null,null,null,null,null,null,null,null,9]
[null,9735240,"462AEN007",null,"HARNESS, FRONT, EXTENSION",null,null,null,null,null,null,null,null,null,9]
[null,9734855,"462AEN008",null,"HARNESS, REAR, EXTENSION",null,null,null,null,null,null,null,null,null,9]
[null,9734958,"462AEN009",null,"HARNESS, FRONT, EXTENSION",null,null,null,null,null,null,null,null,null,9]
[null,9735458,"462AEN010",null,"HARNESS, FRONT, EXTENSION",null,null,null,null,null,null,null,null,null,9]
[null,9735756,"462AEN011",null,"HARNESS, REAR, EXTENSION",null,null,null,null,null,null,null,null,null,9]
[null,9733760,"462AEN012",null,"HARNESS, FRONT, EXTENSION",null,null,null,null,null,null,null,null,null,9]
[null,9734764,"462AEM001",null,"HARNESS, FRONT ADAPTER",null,null,null,null,null,null,null,null,null,10,"SEE NOTE 10"]
[null,9765367,"462AEM004",null,"HARNESS, FRONT ADAPTER",null,null,null,null,null,null,null,null,null,10]
[null,9735562,"462AEM006",null,"HARNESS, FRONT ADAPTER",null,null,null,null,null,null,null,null,null,10]
[null,9734570,"462AEM008",null,"HARNESS, FRONT ADAPTER",null,null,null,null,null,null,null,null,null,10]
[null,9734673,"462AEM010",null,"HARNESS, FRONT ADAPTER",null,null,null,null,null,null,null,null,null,10]
[null,9734776,"462AEM012",null,"HARNESS, FRONT ADAPTER",null,null,null,null,null,null,null,null,null,10]
[null,9734879,"462AEM013",null,"HARNESS, FRONT ADAPTER",null,null,null,null,null,null,null,null,null,10]
[null,9734971,"462AEM002",null,"HARNESS, REAR ADAPTER",null,null,null,null,null,null,null,null,null,10]
[null,9735379,"462AEM005",null,"HARNESS, REAR ADAPTER",null,null,null,null,null,null,null,null,null,10]
[null,9734788,"462AEM007",null,"HARNESS, REAR ADAPTER",null,null,null,null,null,null,null,null,null,10]
[null,9734983,"462AEM009",null,"HARNESS, REAR ADAPTER",null,null,null,null,null,null,null,null,null,10]
[null,9735185,"462AEM011",null,"HARNESS, REAR ADAPTER",null,null,null,null,null,null,null,null,null,10]
[null,9735288,"462AEM014",null,"HARNESS, REAR ADAPTER",null,null,null,null,null,null,null,null,null,10]
[null,9735380,"462AEM016",null,"HARNESS, REAR ADAPTER",null,null,null,null,null,null,null,null,null,10]
[null,9734697,"200CJY001",null,"KIT, PCB, SERIAL INTERFACE",null,null,null,null,null,null,null,null,null,10,"1 0R 0"]
[null,9734790,"186FE001",null,"STATION, ASSEMBLY, CAR TOP, UDO, FRONT",null,null,null,null,null,null,null,null,null,9,"1 OR 0","FRT OR REAR","IS THIS A FRONT OPERATOR?"]
[null,9734892,"186FE002",null,"STATION, ASSEMBLY, CAR TOP, UDO, REAR",null,null,null,null,null,null,null,null,null,9,"1 OR 0","FRT OR REAR","IS THIS A REAR OPERATOR?"]
[]
{"$rows_left_out":24}
{"sheet":"Sheet5","index":4,"n_rows":79,"n_cols":24,"rows_kept":79,"cut":false,"hidden":true,"merged":[[25,12,25,13]]}
[]
[null,"Left Handed",null,null,null,null,null,null,"Right Handed"]
[null,"Part","Print","Decrition",null,null,null,"Part","Print","DESCRIPTION"]
[null,9735422,"200CEV001","DOOR OPERATOR, LH",null,null,null,9734934,"200CEV101","DOOR OPERATOR, RH"]
[null,9736013,"200CRM001","KIT, CABLE TIE",null,null,null,9736013,"200CRM001","KIT, CABLE TIE"]
[null,9736116,"200CTB001","KIT, CAR TOP LIGHT",null,null,null,9736116,"200CTB001","KIT, CAR TOP LIGHT"]
[null,9736311,"200CMM001","KIT, DOOR WEIGHT LABEL",null,null,null,9736311,"200CMM001","KIT, DOOR WEIGHT LABEL"]
[null,9736414,"200CMF001","KIT, WIRING",null,null,null,9736414,"200CMF001","KIT, WIRING"]
[null,9736517,"546WX003","JUNCTION BOX ASSEMBLY, CTS, MOD",null,null,null,9736517,"546WX003","JUNCTION BOX ASSEMBLY, CTS, MOD"]
[null,9736712,"200CLY001","KIT, DOOR OPERATOR MOUNTING",null,null,null,9736712,"200CLY001","KIT, DOOR OPERATOR MOUNTING"]
[null,9736815,"200CTN001","KIT, CLUTCH ACTUATION",null,null,null,9736815,"200CTN001","KIT, CLUTCH ACTUATION"]
[null,9737716,"196BBH001","BRKT ASSY, RELATING CABLE ",null,null,null,9737716,"196BBH001","BRKT ASSY, RELATING CABLE "]
[null,9735033,"364AA25","CEDES MIN-32-NA-TKE (optional) ",null,null,null,9735033,"364AA25","CEDES MIN-32-NA-TKE (optional)"]
[]
[]
[null,"Linear"]
[null,9735136,"196DTA001","BRACKET ASSEMBLY, PULLEY"]
[]
[]
[]
[]
[null,"Front TKE COP&Other"," ",null,null,null,"Front CTB",null,null,null,null,"Front Other"]
[null,9734790,"186FE001","STATION, ASSEMBLY, CAR TOP, UDO, FRONT",null,null,9734892,"186FE002",null,null,null,9734790,"186FE001"]
[null,9735240,"462AEN007",null,null,null,9734958,"462AEN009",null,null,null,9735240,"462AEN007"]
[null,9735458,"462AEN010",null,null,null,9734776,"A62AEn012",null,null,null,9735458,"462AEN010"]
[null,null,null,null,null,null,null,null,null,null,null,9735045,"462AEN006"]
[]
[null,"Rear TKE",null,null,null,null,"Rear CTB",null,null,null,null,null,"Rear Other"]
[null,9734892,"186FE002","STATION, ASSEMBLY, CAR TOP, UDO, REAR",null,9734892,"186FE002","STATION, ASSEMBLY, CAR TOP, UDO, REAR",null,null,null,9734892,"186FE002","STATION, ASSEMBLY, CAR TOP, UDO, REAR"]
[null,9734570,"462AEM008",null,null,9734570,"462AEM008",null,null,null,null,9734570,"462AEM008"]
{"$rows_left_out":50}
{"sheet":"Form Tables. ","index":5,"n_rows":28,"n_cols":12,"rows_kept":28,"cut":false,"hidden":true,"merged":[]}
[]
[]
[]
[]
[]
[]
[null,null,null,"Opening",null,"Front",null,"Rear",null,"Front Controller",null,"Rear Controller"]
[null,null,null,"Front",null,"Front TKE COP",null,"Rear TKE COP",null,"Front TAC32T",null,"Rear TAC32T"]
[null,null,null,"Rear",null,"Front CTB",null,"Rear CTB",null,"Front TAC32H",null,"Rear TAC32H"]
[null,null,null,null,null,"Front Other",null,"Rear Other",null,"Front Futura T / TAC50-04",null,"Rear Futura T / TAC50-04"]
[null,null,null,null,null,null,null,null,null,"Front TAC22 / ICON / TAC20-03 / TAC20 / TAC50-03",null,"Rear TAC22 / ICON / TAC20-03 / TAC20 / TAC50-03"]
[null,null,null,null,null,null,null,null,null,"Front Other",null,"Rear Other"]
[]
[]
[]
[]
[null,null,null,"Gal Opening",null,"No",null,"Yes"]
[null,null,null,"Yes ",null,"N/A",null,"24.000-26.000"]
[null,null,null,"No",null,null,null,"27.000-29.000"]
[null,null,null,null,null,null,null,"30.000-32.000"]
[null,null,null,null,null,null,null,"33.000-35.000"]
[null,null,null,null,null,null,null,"36.000-38.000"]
[null,null,null,null,null,null,null,"39.000-41.000"]
[null,null,null,null,null,null,null,"42.000-44.000"]
[null,null,null,null,null,null,null,"45.000-47.000"]
[null,null,null,null,null,null,null,"48.000-50.000"]
[null,null,null,null,null,null,null,"51.000-56.000"]
[null,null,null,null,null,null,null,"57.000-59.000"]